Highlighted
Absent Member.
Absent Member.
648 views

Compile error for every script - Recorded script with SAP-Web protocal

Hi All,

I have encountered an issues with the recorded script which is generated with C language and SAP-Web protocal . it has been observed recently in earlier we don't phased any issues. can anyone help me in this .. thanks in adavnce

 missing "    Action.c    C:\Anand\Sample8    Sample8

syntax error; found `end of input' expecting `)'    Action.c    C:\Anand\Sample8    Sample8

syntax error; found `end of input' expecting `;'    Action.c    C:\Anand\Sample8    Sample8

syntax error; found `end of input' expecting `;'    Action.c    C:\Anand\Sample8    Sample8

4 errors, not writing pre_cci.ci    Action.c    C:\Anand\Sample8    Sample8

 

 

0 Likes
5 Replies
Highlighted
Absent Member.
Absent Member.

Re: Compile error for every script - Recorded script with SAP-Web protocal

Compiling is getting failed

0 Likes
Highlighted
Absent Member.
Absent Member.

Re: Compile error for every script - Recorded script with SAP-Web protocal

It is the complete error

 

Error: CCI compilation error -c:\anand\sample11\\pre_cci.c: Action.c:21: error: missing "
.
Error: CCI compilation error -c:\anand\sample11\\pre_cci.c: Action.c:21: error: syntax error; found `end of input' expecting `)'
.
Error: CCI compilation error -c:\anand\sample11\\pre_cci.c: Action.c:21: error: syntax error; found `end of input' expecting `;'
.
Error: CCI compilation error -c:\anand\sample11\\pre_cci.c: Action.c:21: warning: missing return value
.
Error: CCI compilation error -c:\anand\sample11\\pre_cci.c: Action.c:21: error: syntax error; found `end of input' expecting `}'
.
Error: CCI compilation error -c:\anand\sample11\\pre_cci.c: Action.c:21: error: 4 errors, not writing pre_cci.ci
.
Error: Vuser compilation failed. Please set CCIDebug to Off in CCI section of mdrv.dat file.
Warning: Extension cciext.dll reports error -19797 on call to function ExtPerProcessInitialize
Error: Thread Context: Call to service of the driver failed, reason - thread context wasn't initialized on this thread.

0 Likes
Highlighted
Honored Contributor.
Honored Contributor.

Re: Compile error for every script - Recorded script with SAP-Web protocal

Can you add the to the thread the step in line 21 and the step above it?

0 Likes
Highlighted
Absent Member.
Absent Member.

Re: Compile error for every script - Recorded script with SAP-Web protocal

    "Url=fonts/OpenSans-Regular.eot", ENDITEM,
        "Url=Images/breadcrumb-bg.png", ENDITEM,

0 Likes
Highlighted
Honored Contributor.
Honored Contributor.

Re: Compile error for every script - Recorded script with SAP-Web protocal

The steps, not the lines 🙂

0 Likes
The opinions expressed above are the personal opinions of the authors, not of Micro Focus. By using this site, you accept the Terms of Use and Rules of Participation. Certain versions of content ("Material") accessible here may contain branding from Hewlett-Packard Company (now HP Inc.) and Hewlett Packard Enterprise Company. As of September 1, 2017, the Material is now offered by Micro Focus, a separately owned and operated company. Any reference to the HP and Hewlett Packard Enterprise/HPE marks is historical in nature, and the HP and Hewlett Packard Enterprise/HPE marks are the property of their respective owners.